{"text_format":"1","workbook":"xlsx","n_sheets":6,"sheets":["Input form","Question control","Guideline documents","Respondent information","Preparatory questions","Questions and Scoring Items"],"not_rendered":{"charts":4,"images":72,"macros":1,"external_links":0,"defined_names":1,"comments":0,"pivot_tables":0},"unopened":[],"bounds":{"document_bytes":16777216,"sheet_cells":100000,"rows_first":2000,"rows_last":500,"rows_between":2000,"halvings":0,"cell_chars":16384,"cell_head_chars":4096},"cells_cut":0,"cells_raw":0,"read":"whole","date_system":"1900"}

{"sheet":"Input form","index":0,"n_rows":664,"n_cols":14,"rows_kept":664,"cut":false,"hidden":false,"merged":[[459,5,459,8],[429,5,429,8],[229,4,229,8],[428,5,428,8],[380,4,380,8],[363,4,363,8],[45,4,45,8],[7,1,7,6],[511,1,513,8],[505,1,505,8],[510,1,510,8],[506,1,506,8],[507,1,509,8],[419,5,419,8],[420,5,420,8],[440,5,440,8],[441,5,441,8],[442,5,442,8],[431,5,431,8],[432,5,432,8],[452,5,452,8],[453,5,453,8],[454,5,454,8],[457,5,457,8],[458,5,458,8],[424,5,424,8],[425,5,425,8],[426,5,426,8],[427,5,427,8],[381,5,381,8],[382,5,382,8],[383,5,383,8],[384,5,384,8],[385,5,385,8],[386,5,386,8],[387,5,387,8],[416,5,416,8],[417,5,417,8],[389,5,389,8],[390,5,390,8],[391,5,391,8],[392,5,392,8],[393,5,393,8],[394,5,394,8],[395,5,395,8],[407,5,407,8],[302,5,302,8],[314,5,314,8],[315,5,315,8],[316,5,316,8],[317,5,317,8],[318,5,318,8],[319,5,319,8],[489,5,489,8],[305,5,305,8],[306,5,306,8],[307,5,307,8],[308,5,308,8],[309,5,309,8],[310,5,310,8],[311,5,311,8],[313,5,313,8],[348,5,348,8],[349,5,349,8],[350,5,350,8],[351,5,351,8],[352,5,352,8],[354,5,354,8],[355,5,355,8],[468,5,468,8],[341,5,341,8],[342,5,342,8],[343,5,343,8],[344,5,344,8],[346,5,346,8],[347,5,347,8],[376,5,376,8],[377,5,377,8],[378,5,378,8],[373,5,373,8],[358,5,358,8],[359,5,359,8],[360,5,360,8],[356,5,356,8],[357,5,357,8],[322,5,322,8],[323,5,323,8],[324,5,324,8],[325,5,325,8],[326,5,326,8],[327,5,327,8],[328,5,328,8],[339,5,339,8],[340,5,340,8],[292,5,292,8],[293,5,293,8],[294,5,294,8],[296,5,296,8],[297,5,297,8],[298,5,298,8],[299,5,299,8],[300,5,300,8],[301,5,301,8],[282,5,282,8],[283,5,283,8],[284,5,284,8],[285,5,285,8],[286,5,286,8],[288,5,288,8],[289,5,289,8],[290,5,290,8],[291,5,291,8],[252,5,252,8],[253,5,253,8],[255,5,255,8],[256,5,256,8],[257,5,257,8],[258,5,258,8],[259,5,259,8],[260,5,260,8],[272,5,272,8],[261,5,261,8],[263,5,263,8],[264,5,264,8],[265,5,265,8],[266,5,266,8],[267,5,267,8],[268,5,268,8],[269,5,269,8],[271,5,271,8],[254,4,254,8],[270,4,270,8],[241,5,241,8],[242,5,242,8],[243,5,243,8],[244,5,244,8],[247,5,247,8],[248,5,248,8],[249,5,249,8],[250,5,250,8],[251,5,251,8],[231,5,231,8],[232,5,232,8],[233,5,233,8],[234,5,234,8],[235,5,235,8],[236,5,236,8],[238,5,238,8],[239,5,239,8],[240,5,240,8],[237,4,237,8],[208,5,208,8],[209,5,209,8],[211,5,211,8],[212,5,212,8],[213,5,213,8],[214,5,214,8],[215,5,215,8],[216,5,216,8],[217,5,217,8],[198,5,198,8],[199,5,199,8],[200,5,200,8],[201,5,201,8],[203,5,203,8],[204,5,204,8],[205,5,205,8],[206,5,206,8],[207,5,207,8],[166,5,166,8],[188,5,188,8],[189,5,189,8],[190,5,190,8],[191,5,191,8],[192,5,192,8],[195,5,195,8],[196,5,196,8],[197,5,197,8],[194,4,194,8],[161,5,161,8],[163,5,163,8],[164,5,164,8],[165,5,165,8],[142,5,142,8],[143,5,143,8],[144,5,144,8],[145,5,145,8],[146,5,146,8],[147,5,147,8],[148,5,148,8],[162,5,162,8],[155,5,155,8],[160,5,160,8],[8,1,8,6],[9,1,9,6],[10,1,10,6],[74,5,74,8],[75,5,75,8],[116,5,116,8],[124,5,124,8],[153,5,153,8],[154,5,154,8],[139,5,139,8],[76,5,76,8],[77,5,77,8],[78,5,78,8],[79,5,79,8],[80,5,80,8],[82,5,82,8],[83,5,83,8],[84,5,84,8],[85,5,85,8],[86,5,86,8],[87,5,87,8],[88,5,88,8],[90,5,90,8],[91,5,91,8],[92,5,92,8],[93,5,93,8],[94,5,94,8],[95,5,95,8],[433,5,433,8],[434,5,434,8],[435,5,435,8],[436,5,436,8],[437,5,437,8],[96,5,96,8],[106,5,106,8],[107,5,107,8],[108,5,108,8],[109,5,109,8],[110,5,110,8],[111,5,111,8],[112,5,112,8],[98,5,98,8],[99,5,99,8],[100,5,100,8],[101,5,101,8],[102,5,102,8],[103,5,103,8],[104,5,104,8],[133,5,133,8],[134,5,134,8],[135,5,135,8],[136,5,136,8],[137,5,137,8],[138,5,138,8],[156,5,156,8],[117,5,117,8],[118,5,118,8],[119,5,119,8],[120,5,120,8],[121,5,121,8],[122,5,122,8],[125,5,125,8],[126,5,126,8],[127,5,127,8],[128,5,128,8],[129,5,129,8],[130,5,130,8],[150,5,150,8],[151,5,151,8],[152,5,152,8],[221,5,221,8],[222,5,222,8],[223,5,223,8],[224,5,224,8],[225,5,225,8],[226,5,226,8],[227,5,227,8],[230,5,230,8],[169,5,169,8],[170,5,170,8],[171,5,171,8],[172,5,172,8],[173,5,173,8],[174,5,174,8],[175,5,175,8],[186,5,186,8],[187,5,187,8],[177,5,177,8],[178,5,178,8],[179,5,179,8],[180,5,180,8],[181,5,181,8],[182,5,182,8],[183,5,183,8],[273,5,273,8],[274,5,274,8],[275,5,275,8],[276,5,276,8],[277,5,277,8],[280,5,280,8],[281,5,281,8],[374,5,374,8],[375,5,375,8],[364,5,364,8],[365,5,365,8],[366,5,366,8],[367,5,367,8],[368,5,368,8],[369,5,369,8],[370,5,370,8],[331,5,331,8],[332,5,332,8],[333,5,333,8],[334,5,334,8],[335,5,335,8],[336,5,336,8],[330,5,330,8],[338,5,338,8],[379,5,379,8],[406,5,406,8],[418,5,418,8],[443,5,443,8],[444,5,444,8],[445,5,445,8],[446,5,446,8],[448,5,448,8],[449,5,449,8],[408,5,408,8],[409,5,409,8],[410,5,410,8],[411,5,411,8],[412,5,412,8],[398,5,398,8],[399,5,399,8],[400,5,400,8],[401,5,401,8],[402,5,402,8],[403,5,403,8],[404,5,404,8],[415,5,415,8],[421,5,421,8],[423,5,423,8],[467,5,467,8],[450,5,450,8],[451,5,451,8],[466,4,466,8],[456,4,456,8],[462,5,462,8],[463,5,463,8],[461,5,461,8],[493,5,493,8],[469,5,469,8],[470,5,470,8],[471,5,471,8],[472,5,472,8],[473,5,473,8],[484,5,484,8],[485,5,485,8],[475,5,475,8],[476,5,476,8],[477,5,477,8],[478,5,478,8],[479,5,479,8],[480,5,480,8],[481,5,481,8],[460,5,460,8],[494,5,494,8],[495,5,495,8],[496,5,496,8],[497,5,497,8],[498,5,498,8],[499,5,499,8],[486,5,486,8],[487,5,487,8],[488,5,488,8],[490,5,490,8]]}
[null,"Self-diagnosis Sheet for the Guidelines for the Management of Chemicals in Products"]
[]
[]
[]
[null,"Self-diagnosis Sheet for the Guidelines for the Management of Chemicals in Products"]
[]
[null,"Respondent information"]
[null,"Response date (yyyy/mm/dd)"]
[null,"Supplier code"]
[null,"Company name",null,null,null,null,null,null,""]
[null,"Organization name (e.g., division name, department name, or office name)",null,null,null,null,null,null,""]
[null,"Management operations for ",null,null,null,null,"Department of the responsible person",null,""]
[null,"chemicals in products",null,null,null,null,"Information on","Title",""]
[null,"(environmental operations)",null,null,null,null,"the responsible","Name",""]
[null,null,null,null,null,null,"person","Phone number",""]
{"$rows_left_out":650}
{"sheet":"Question control","index":1,"n_rows":74,"n_cols":67,"rows_kept":74,"cut":false,"hidden":true,"merged":[[1,5,1,8],[9,17,9,66],[8,4,8,66],[11,1,73,1],[8,1,10,3],[24,2,73,2],[11,2,23,2],[9,4,9,16]]}
[]
[null,null,null,null,null,"Always display questions"]
[null,null,null,null,"N","Criterion-> line 11 is No, Action-> Hide/Grey Qusetion in column D"]
[null,null,null,null,"Y","Criterion-> line 11 is Yes, Action-> Hide/Grey Qusetion in column D"]
[null,null,null,null,"G","Hide/Grey questions"]
[null,null,null,null,"D","Always hide questions"]
[]
[null,null,null,0,1,2,3,4,5,6,7,8,9,10,11,12,13,14,15,16,17,18,19,20,21,22,23,24,25,26,27,28,29,30,31,32,33,34,35,36,37,38,39,40,41,42,43,44,45,46,47,48,49,50,51,52,53,54,55,56,57,58,59,60,61,62,63]
[null,null,null,null,"　　　⇒　Criterion"]
[null,null,null,null,"Preparatory",null,null,null,null,null,null,null,null,null,null,null,null,"Form"]
[0,null,null,null,"C1.","C2.","C3.","C4.","C5.","C6.","C7.","C8.","C9.","C10.","C11.","C12.","C13.","Q1.","Q2.","Q3.","Q4.","Q5.","Q6.","Q7.","Q8.","Q9.","Q10.","Q11.","Q12.","Q13.","Q14.","Q15.","Q16.","Q17.","Q18.","Q19.","Q20.","Q21.","Q22.","Q23.","Q24.","Q25.","Q26.","Q27.","Q28.","Q29.","Q30.","Q31.","Q32.","Q33.","Q34.","Q35.","Q36.","Q37.","Q38.","Q39.","Q40.","Q41.","Q42.","Q43.","Q44.","Q45.","Q46.","Q47.","Q48.","Q49.","Q50."]
[1,"　　↓　Action","Preparatory","C1."]
[2,null,null,"C2."]
[3,null,null,"C3."]
[4,null,null,"C4."]
{"$rows_left_out":60}
{"sheet":"Guideline documents","index":2,"n_rows":182,"n_cols":7,"rows_kept":182,"cut":false,"hidden":true,"merged":[]}
[]
[null,"1.","State of the organization and management system"]
[null,null,"1.1.","Management system"]
[null,null,null,"1.1.1.","Acquisition of management system certifications (acquisition of ISO14001 or other environmental certification (simplified EMS)) and operation of it",null,"Q1."]
[null,null,null,null,"[ Check Item: 5.1.1.1 Acquisition of management system certifications (acquisition of ISO14001 or other environmental certification (simplified EMS)) and operation of it ]"]
[null,null,null,null,"Each company or organization shall acquire these management system certifications and take action according to the acquired certifications.\nIt is best to conduct internal and external audits on a regular basis to maintain the management systems."]
[null,null,null,"1.1.2.","マネジメントシステムの維持管理とその実態",null,"Q2."]
[]
[]
[null,null,"1.0.","組織の状態"]
[null,null,null,"1.0.1.","組織及びその状況の理解の有無と実態",null,"Q3."]
[]
[]
[null,null,null,"1.0.2.","利害関係者のニーズ及び期待の理解の有無と実態",null,"Q4."]
[]
{"$rows_left_out":168}
{"sheet":"Respondent information","index":3,"n_rows":15,"n_cols":5,"rows_kept":15,"cut":false,"hidden":true,"merged":[[2,1,2,3],[3,1,3,3],[4,1,4,3],[5,1,9,1],[10,1,14,1],[6,2,9,2],[11,2,14,2],[5,2,5,3],[10,2,10,3]]}
[]
[]
[null,"Supplier code",null,null,{"$f":"IF('Input form'!I9=\"\",\"\",'Input form'!I9)","v":""}]
[null,"Company name",null,null,{"$f":"IF('Input form'!I10=\"\",\"\",'Input form'!I10)","v":""}]
[null,"Organization name (e.g., division name, department name, or office name)",null,null,{"$f":"IF('Input form'!I11=\"\",\"\",'Input form'!I11)","v":""}]
[null,"Management operationsfor \nchemicals in products\n(environmental operations)","Department of the responsible person",null,{"$f":"IF('Input form'!I12=\"\",\"\",'Input form'!I12)","v":""}]
[null,null,"Information on \nthe responsible \nperson","Title",{"$f":"IF('Input form'!I13=\"\",\"\",'Input form'!I13)","v":""}]
[null,null,null,"Name",{"$f":"IF('Input form'!I14=\"\",\"\",'Input form'!I14)","v":""}]
[null,null,null,"Phone number",{"$f":"IF('Input form'!I15=\"\",\"\",'Input form'!I15)","v":""}]
[null,null,null,"E-mail",{"$f":"IF('Input form'!I16=\"\",\"\",'Input form'!I16)","v":""}]
[null,"Department in charge","Responding department",null,{"$f":"IF('Input form'!I17=\"\",\"\",'Input form'!I17)","v":""}]
[null,null,"Information on\nthe person in\ncharge","Title",{"$f":"IF('Input form'!I18=\"\",\"\",'Input form'!I18)","v":""}]
[null,null,null,"Name",{"$f":"IF('Input form'!I19=\"\",\"\",'Input form'!I19)","v":""}]
[null,null,null,"Phone number",{"$f":"IF('Input form'!I20=\"\",\"\",'Input form'!I20)","v":""}]
[null,null,null,"E-mail",{"$f":"IF('Input form'!I21=\"\",\"\",'Input form'!I21)","v":""}]
{"$rows_left_out":1}
{"sheet":"Preparatory questions","index":4,"n_rows":33,"n_cols":11,"rows_kept":33,"cut":false,"hidden":true,"merged":[[2,3,7,4],[2,8,3,8],[10,8,13,8],[10,3,14,4],[8,3,9,4]]}
[]
[null,null,"Preparatory questions",null,null,null,"Answer","Specific examples (optional)"]
[null,null,1,"Questions about delivered products and details of the transactions",null,"Do you deliver parts or materials for currently mass-produced products?","No information",{"$f":"IF('Input form'!I28<>\"\",'Input form'!I28,\"\")","v":""},null,null,{"$f":"IF('Input form'!L28<>\"\",'Input form'!L28,\"\")","v":""}]
[null,null,2,null,null,"Do you deliver legacy spare parts or materials to support legacy models?","No information",{"$f":"IF('Input form'!I31<>\"\",'Input form'!I31,\"\")","v":""},null,null,{"$f":"IF('Input form'!L29<>\"\",'Input form'!L29,\"\")","v":""}]
[null,null,3,null,null,"Do you deliver prototype parts?","No information",{"$f":"IF('Input form'!I34<>\"\",'Input form'!I34,\"\")","v":""},null,null,{"$f":"IF('Input form'!L30<>\"\",'Input form'!L30,\"\")","v":"C2."}]
[null,null,4,null,null,"Do you deliver plant facilities or secondary plant materials?","No information",{"$f":"IF('Input form'!I37<>\"\",'Input form'!I37,\"\")","v":""},null,null,{"$f":"IF('Input form'!L31<>\"\",'Input form'!L31,\"\")","v":""}]
[null,null,5,null,null,"Do you design and develop parts and materials?","No information",{"$f":"IF('Input form'!I40<>\"\",'Input form'!I40,\"\")","v":""},null,null,{"$f":"IF('Input form'!L32<>\"\",'Input form'!L32,\"\")","v":""}]
[null,null,6,null,null,"Do you deliver parts and materials as a trading company or distributor without actually manufacturing them?","No information",{"$f":"IF('Input form'!I43<>\"\",'Input form'!I43,\"\")","v":""},null,null,{"$f":"IF('Input form'!L33<>\"\",'Input form'!L33,\"\")","v":"C3."}]
[null,null,7,"Questions about your business",null,"Do your manufacturing processes include conversion processes listed in Table 4.2 in the Guidelines (manufacturing processes in which the composition of chemicalsubstances changes due to oxidation reaction, reduction reaction, or other phenomenon or manufacturing processes in which the concentration of chemical substanceschanges due to condensation, evaporation, or other phenomenon)?","No information",{"$f":"IF('Input form'!I47<>\"\",'Input form'!I47,\"\")","v":""},null,null,{"$f":"IF('Input form'!L34<>\"\",'Input form'!L34,\"\")","v":""}]
[null,null,8,null,null,"Do your domestic and overseas subsidiaries and subcontractors perform production activities?","No information",{"$f":"IF('Input form'!I50<>\"\",'Input form'!I50,\"\")","v":""},null,null,{"$f":"IF('Input form'!L35<>\"\",'Input form'!L35,\"\")","v":""}]
[null,null,9,"Basic questions about your management situation",null,"Do you use industry-standard communication tools (e.g., IMDS, JAPIA sheet, AIS sheet, or chemSHELPA) for chemicals in your products?","No information",{"$f":"IF('Input form'!I54<>\"\",'Input form'!I54,\"\")","v":""},null,null,{"$f":"IF('Input form'!L36<>\"\",'Input form'!L36,\"\")","v":"C4."}]
[null,null,10,null,null,"Do you apply the latest versions of management criteria (such as the GADSL) for the tools you use mentioned in question C9?","No information",{"$f":"IF('Input form'!I57<>\"\",'Input form'!I57,\"\")","v":""},null,null,{"$f":"IF('Input form'!L37<>\"\",'Input form'!L37,\"\")","v":""}]
[null,null,11,null,null,"Do you use the latest version of customer management criteria (or the latest GADSL if the latest version of customer management criteria is not available)?","No information",{"$f":"IF('Input form'!I60<>\"\",'Input form'!I60,\"\")","v":""},null,null,{"$f":"IF('Input form'!L38<>\"\",'Input form'!L38,\"\")","v":""}]
[null,null,12,null,null,"Do you refer to the latest version of the customer-specified IMDS manual (or IMDS training manual if the IMDS manual is not available)?","No information",{"$f":"IF('Input form'!I63<>\"\",'Input form'!I63,\"\")","v":""},null,null,{"$f":"IF('Input form'!L39<>\"\",'Input form'!L39,\"\")","v":"C5."}]
[null,null,13,null,null,"Does your company have a capital of less than 300 million yen or fewer than 300 employees?","No information",{"$f":"IF('Input form'!I66<>\"\",'Input form'!I66,\"\")","v":""},null,null,{"$f":"IF('Input form'!L40<>\"\",'Input form'!L40,\"\")","v":""}]
{"$rows_left_out":19}
{"sheet":"Questions and Scoring Items","index":5,"n_rows":60,"n_cols":25,"rows_kept":60,"cut":false,"hidden":false,"merged":[[58,3,59,3],[58,4,58,6],[59,4,59,6],[58,7,58,10],[59,7,59,10],[39,4,40,4],[51,4,53,4],[2,11,3,15],[2,0,3,1],[2,3,4,4],[2,5,4,6],[2,7,4,8],[2,9,3,10]]}
[]
[{"$f":"SUM(A6:A55)","v":100},{"$f":"SUM(B6:B55)","v":100}]
["WF",null,null,"Level 1",null,"Level 2",null,"Level 3",null,"Answer result",null,"Answer  options",null,null,null,null,null,null,null,null,null,"有無素点","有無スコア","実施状況素点","実施状況スコア"]
[]
["Process","Operation",null,null,null,null,null,null,null,"Process Level","Operation Level",1,2,3,4,5,null,null,"有無満点","実施満点","Score",{"$f":"SUM(Q6:Q55)","v":0},{"$f":"V5/SUM(S6:S55)*100","v":{"$error":"#DIV/0!"}},{"$f":"SUM(R6:R55)","v":0},{"$f":"X5/SUM(T6:T55)*100","v":{"$error":"#DIV/0!"}}]
[3,3,1,1,"State of the organization and management system",1.1000000000000001,"Management system","1.1.1","Acquisition of management system certifications (acquisition of ISO14001 or other environmental certification (simplified EMS)) and operation of it",null,null,"We have not acquired management system certifications.","We have acquired management system certifications but do not have a system for maintaining them.","We perform activities according to the certified system on an irregular basis.","We conduct internal audits on a regular basis to maintain certifications.","We conduct internal and external audits on a regular basis to maintain certifications.",{"$f":"IF(J6=\"Yes\",A6,\"\")","v":""},{"$f":"IF(ISNUMBER(K6),K6/5*B6,\"\")","v":""},{"$f":"IF(OR(J6=\"Not available\",J6=\"\"),0,A6)","v":0},{"$f":"IF(OR(J6=\"Not available\",J6=\"\"),0,B6)","v":0},{"$f":"D6&\"_\"&E6","v":"1_State of the organization and management system"},{"$f":"SUM(Q6:Q10)","v":0},{"$f":"V6/SUM(S6:S10)*100","v":{"$error":"#DIV/0!"}},{"$f":"SUM(R6:R10)","v":0},{"$f":"X6/SUM(T6:T10)*100","v":{"$error":"#DIV/0!"}}]
[0,0,2,null,"",null,"","1.1.2","NQ","Not available","Not available",null,null,null,null,null,{"$f":"IF(J7=\"有\",A7,\"\")","v":""},{"$f":"IF(ISNUMBER(K7),K7/5*B7,\"\")","v":""},{"$f":"IF(OR(J7=\"無効\",J7=\"\"),0,A7)","v":0},{"$f":"IF(OR(J7=\"無効\",J7=\"\"),0,B7)","v":0}]
[0,0,3,null,"",null,"","1.1.3","NQ","Not available","Not available",null,null,null,null,null,"","",0,0]
[0,0,4,null,"",null,"","1.1.4","NQ","Not available","Not available",null,null,null,null,null,"","",0,0]
[0,0,5,null,"",null,"","1.1.5","NQ","Not available","Not available",null,null,null,null,null,"","",0,0]
[2,2,6,2,"Basic policy and management framework",2.1,"Basic policy on chemicals in products","2.1.1","Existence of policy on management of chemicals in products and dissemination in and outside the company (organization)",null,null,"We do not have a policy on management of chemicals in products.","Although the department in charge of actual operations has a policy, that policy is not used throughout the company (organization). ","We have established a company (organization) policy, disseminated it in the company (organization), and publicly announced it.","We review and update the policy on a regular basis and announce details in the company (organization).","We review and update the policy on a regular basis and announce details publicly as well as in the company (organization).",{"$f":"IF(J11=\"Yes\",A11,\"\")","v":""},"",{"$f":"IF(OR(J11=\"Not available\",J11=\"\"),0,A11)","v":0},{"$f":"IF(OR(J11=\"Not available\",J11=\"\"),0,B11)","v":0},{"$f":"D11&\"_\"&E11","v":"2_Basic policy and management framework"},{"$f":"SUM(Q11:Q15)","v":0},{"$f":"V11/SUM(S11:S15)*100","v":{"$error":"#DIV/0!"}},{"$f":"SUM(R11:R15)","v":0},{"$f":"X11/SUM(T11:T15)*100","v":{"$error":"#DIV/0!"}}]
[0,0,7,null,"",null,"","2.1.2","NQ","Not available","Not available",null,null,null,null,null,"","",0,0]
[3,3,8,null,"",2.2000000000000002,"Management framework for chemicals in products","2.2.1","Existence and operation of a management framework for chemicals in products in the company (organization)",null,null,"We do not have a management framework for chemicals in products in the company (organization).","We have a management framework for chemicals in products in the company (organization) but it has not been defined as provisions.","We have provisions for the management framework for chemicals in products in the company (organization) and perform relevant operations.","We reliably perform operations according to provisions. We also have and implement a system to review and revise the provisions on a regular basis.","We have and implement a system to evaluate and verify the actual management and operation of relevant operations in the company according to the latest provisions(e.g., upper-level organization that receives reports and internal audits).",{"$f":"IF(J13=\"Yes\",A13,\"\")","v":""},"",{"$f":"IF(OR(J13=\"Not available\",J13=\"\"),0,A13)","v":0},{"$f":"IF(OR(J13=\"Not available\",J13=\"\"),0,B13)","v":0}]
[2,2,9,null,"",2.2999999999999998,"Governance over domestic and overseas subsidiaries and subcontractors","2.3.1","Establishment and operation of a governance and management framework for domestic and overseas subsidiaries and subcontractors",null,null,"We do not have a governance and management framework for domestic and overseas subsidiaries and subcontractors.","We do not have provisions for the management framework for domestic and overseas subsidiaries and subcontractors but have a mutually agreed-on framework.","We have provisions for the management framework for domestic and overseas subsidiaries and subcontractors and perform relevant operations.","We reliably perform operations according to the provisions. We also have and implement a system to review and revise the provisions on a regular basis.","We have and implement a system to evaluate and verify the actual management and operation of relevant operations in the company according to the latest provisions.",{"$f":"IF(J14=\"Yes\",A14,\"\")","v":""},"",{"$f":"IF(OR(J14=\"Not available\",J14=\"\"),0,A14)","v":0},{"$f":"IF(OR(J14=\"Not available\",J14=\"\"),0,B14)","v":0}]
[0,0,10,null,"",null,"","2.3.2","NQ","Not available","Not available",null,null,null,null,null,"","",0,0]
{"$rows_left_out":45}